[pvrusb2] Test : Compile with 2.6.14-rc1

xavier.gnata at free.fr xavier.gnata at free.fr
Mon Sep 19 16:32:03 CDT 2005


I just have tested to compiled a 2.6.14-rc1 : This seems to works just fine on
my box.
I have of course try to compile the pvrusb2 driver and it failled in a quite
strange way :

root at dupilon:/usr/local/pvrusb2-mci-20050911/driver#make
make INSTALL_MOD_DIR=pvrusb2 -C /lib/modules/2.6.14-rc1-1/build
M=/usr/local/pvrusb2-mci-20050911/driver modules
make[1]: Entering directory `/usr/src/linux-2.6.14-rc1'
  CC [M]  /usr/local/pvrusb2-mci-20050911/driver/pvrusb2-msp34x5g.o
  CC [M]  /usr/local/pvrusb2-mci-20050911/driver/pvrusb2-encoder.o
  CC [M]  /usr/local/pvrusb2-mci-20050911/driver/pvrusb2-saa7115.o
  CC [M]  /usr/local/pvrusb2-mci-20050911/driver/pvrusb2-eeprom.o
/usr/local/pvrusb2-mci-20050911/driver/pvrusb2-eeprom.c: In function
/usr/local/pvrusb2-mci-20050911/driver/pvrusb2-eeprom.c:86: warning: passing
argument 1 of 'tveeprom_hauppauge_analog' from incompatible pointer type
/usr/local/pvrusb2-mci-20050911/driver/pvrusb2-eeprom.c:86: warning: passing
argument 2 of 'tveeprom_hauppauge_analog' from incompatible pointer type
/usr/local/pvrusb2-mci-20050911/driver/pvrusb2-eeprom.c:86: error: too few
arguments to function 'tveeprom_hauppauge_analog'
make[2]: *** [/usr/local/pvrusb2-mci-20050911/driver/pvrusb2-eeprom.o] Error 1
make[1]: *** [_module_/usr/local/pvrusb2-mci-20050911/driver] Error 2
make[1]: Leaving directory `/usr/src/linux-2.6.14-rc1'
make: *** [modules] Error 2

I quite tired this week... so I would like someone else to test once again and
say us if it works or not. If it doesn't, I will try to chase down this bug.

ps : Why is there no *simple and complete* api kernel changelog when a new
kernel version is released?? The kernel api are not stable at all (ok, that is
the way the kernel is developed. Great) but it *should* (shall?) be

More information about the pvrusb2 mailing list